BDBM303319 2-amino-8-fluoro-N-[(2- isopropylthiazol-4- yl)methyl]quinazoline-4- carboxamide::US10138212, Example 82
SMILES CC(C)c1nc(CNC(=O)c2nc(N)nc3c(F)cccc23)cs1
InChI Key InChIKey=WNUOFCWJTGUYOS-UHFFFAOYSA-N
Data  1 KI
  Tab Delimited (TSV)   2D SDfile   Computed 3D by Vconf -m prep SDfile
Find this compound or compounds like it in BindingDB:
Activity Spreadsheet -- Enzyme Inhibition Constant Data from BindingDB
Found 1 hit for monomerid = 303319
TargetAdenosine receptor A2a(Homo sapiens (Human))
Merck Sharp & Dohme
US Patent
LigandPNGBDBM303319(2-amino-8-fluoro-N-[(2- isopropylthiazol-4- yl)met...)
Affinity DataKi:  0.600nM. Assay description: Binding affinities of compounds of the invention for the human A2a receptor were determined in a competition binding assay using Scintillation Proxim...
Ligand InfoPC cidPC sid
In DepthDetails US Patent